آتشفشان شکافه‏ای
type: Concept
broader: آتشفشان
preferred label: fissure volcano @en
scope note: یکی از دهانه‏های آتشفشانی واقع بر روی یک شکافه

آتشفشان
type: Concept
narrower: آتشفشان شکافه‏ای
preferred label: volcano @en