آتشفشان فعال
type: Concept
broader: آتشفشان
preferred label: active volcano @en
scope note: آتشفشانی که فوران می‏کند یا در طول تاریخ بشر فوران کرده است

آتشفشان
type: Concept
narrower: آتشفشان فعال
preferred label: volcano @en