ایزگونه
type: Concept
preferred label: ichnospecies @en
related: ایزسرده
related: ایزفسیل
scope note: گروهی از ایزفسیل‌های متعلق به یک ایزسرده که دارای خصوصیات یکسان هستند

ایزفسیل
type: Concept
preferred label: ichnofossil @en
related: ایزگونه

ایزسرده
type: Concept
preferred label: ichnogenus @en
related: ایزگونه