زوفیکوس
type: Concept
broader: ایزفسیل
preferred label: Zoophycos @en
scope note: فسیل ردپایی. آثار شعاعی و کمانی قابل رویت در سنگهای رسوبی، خصوصاً در آهکهای مارن دار

ایزفسیل
type: Concept
narrower: زوفیکوس
preferred label: ichnofossil @en