ایزگونه
type: Concept
preferred label: ichnospecies @en
related: ایزسرده

ایزفسیل
type: Concept
preferred label: ichnofossil @en
related: ایزسرده

ایزسرده
type: Concept
preferred label: ichnogenus @en
related: ایزگونه
related: ایزفسیل
scope note: گروهی از ایزفسیل‌ها که ازنظر گونه‌ای و اندامگانی به ‌هم شباهت بسیار دارند