اسمولنسک فدراسیون روسیه
type: Concept
broader: فدراسیون روسیه
preferred label: Smolensk Russian Federation @en
scope note: استانی شامل شهری در کناره چپ رود دنیپر بالایی جنوب غرب مسکو

فدراسیون روسیه
type: Concept
narrower: اسمولنسک فدراسیون روسیه
preferred label: Russian Federation @en