پروکوپیوسک فدراسیون روسیه
type: Concept
broader: فدراسیون روسیه
preferred label: Prokopyevsk Russian Federation @en
scope note: شهری در جنوب انتهای حوزه کوزنتسک در استان خودمختار کمرووُ در جنوب سیبری

فدراسیون روسیه
type: Concept
narrower: پروکوپیوسک فدراسیون روسیه
preferred label: Russian Federation @en