آتاسو قزاقستان
type: Concept
broader: قزاقستان
preferred label: Atasu Kazakhstan @en
scope note: روستایی در مرکز قزاقستان، شمال غرب دریاچه بلخاش

قزاقستان
type: Concept
narrower: آتاسو قزاقستان
preferred label: Kazakhstan @en