وودوارد اوکلاهما
type: Concept
broader: اوکلاهما
preferred label: Woodward Oklahoma @en
scope note: شهری درکناره رود کانادایی شمالی در شمال غرب اوکلاهما

اوکلاهما
type: Concept
narrower: وودوارد اوکلاهما
preferred label: Oklahoma @en