رشته‌کوه لمی
type: Concept
broader: ایداهو
preferred label: Lemhi Range @en
related: ناحیه باتلر ایداهو
scope note: شرق مرکز آیداهو. به صورت اولیه در نواحی لمی و بوته.

ناحیه باتلر ایداهو
type: Concept
preferred label: Butte County Idaho @en
related: رشته‌کوه لمی

ایداهو
type: Concept
narrower: رشته‌کوه لمی
preferred label: Idaho @en