حوضه تونتو
type: Concept
broader: ناحیه گیلا آریزونا
preferred label: Tonto Basin @en
scope note: دره ای در شمال ناحیه گیلادر مرکز آریزونا

ناحیه گیلا آریزونا
type: Concept
narrower: حوضه تونتو
preferred label: Gila County Arizona @en