جزیره آداک
type: Concept
broader: آلاسکای جنوب غربی
preferred label: Adak Island @en
scope note: در بخش مرکزی جزایر آلوسین جنوب غرب شبه جزیره آلاسکا

آلاسکای جنوب غربی
type: Concept
narrower: جزیره آداک
preferred label: Southwestern Alaska @en