آتشفشان
type: Concept
preferred label: volcano @en
related: ردوبت

ردوبت
type: Concept
broader: آلاسکای جنوبی
preferred label: Redoubt @en
related: آتشفشان
scope note: آتشفشانی در غرب فروافتادگی کوک در پارک ملی لیک کلارک، جنوب آلاسکا

آلاسکای جنوبی
type: Concept
narrower: ردوبت
preferred label: Southern Alaska @en