رشته‌کوه سنت الیاس
type: Concept
preferred label: Saint Elias Mountains @en
related: یخچال برینگ

یخچال برینگ
type: Concept
broader: آلاسکای جنوبی
preferred label: Bering Glacier @en
related: رشته‌کوه سنت الیاس
scope note: سیستم یخچالی ناحیه سنت الیاس، غرب و شمال غرب دماغه یاکاتاگا، به خلیج آلاسکا ریخته می شود

آلاسکای جنوبی
type: Concept
narrower: یخچال برینگ
preferred label: Southern Alaska @en