آلاسکای غربی-مرکزی
type: Concept
broader: آلاسکا
preferred label: West-Central Alaska @en
scope note: ناحیه مصنوعی بر مبنای اسامی چهارگوش سازمان زمین‌شناسی ایالات متحده شامل جزیره سنت لوئیس

آلاسکا
type: Concept
narrower: آلاسکای غربی-مرکزی
preferred label: Alaska @en