جزیره گالوستون
type: Concept
broader: ناحیه گالوستون تگزاس
preferred label: Galveston Island @en
scope note: جزیره‌ای به طول 30 مایل در ورودی خلیج گالوستون.

ناحیه گالوستون تگزاس
type: Concept
narrower: جزیره گالوستون
preferred label: Galveston County Texas @en