ناحیه کنت جزیره رود
type: Concept
broader: جزیره رُود
preferred label: Kent County Rhode Island @en
scope note: روی خلیج نارراگانست در غرب و مرکز جزیره رود.

جزیره رُود
type: Concept
narrower: ناحیه کنت جزیره رود
preferred label: Rhode Island @en