خلیج تامپا
type: Concept
broader: فلوریدا
preferred label: Tampa Bay @en
related: ناحیه پینلاس فلوریدا
scope note: شاخابه خلیج مکزیک در ساحل غربی ناحیه هیلسبور در غرب فلوریدا.

ناحیه پینلاس فلوریدا
type: Concept
preferred label: Pinellas County Florida @en
related: خلیج تامپا

فلوریدا
type: Concept
narrower: خلیج تامپا
preferred label: Florida @en