دره سان فرناندو
type: Concept
broader: کالیفرنیا
preferred label: San Fernando Valley @en
related: گسل سیلمار
scope note: حوضه حاصلخیزی در حدود 20 مایلی شمال غرب داون تاون لوس آنجلس

گسل سیلمار
type: Concept
preferred label: Sylmar Fault @en
related: دره سان فرناندو

کالیفرنیا
type: Concept
narrower: دره سان فرناندو
preferred label: California @en