دره اوونس
type: Concept
preferred label: Owens Valley @en
related: دریاچه اوونس

دریاچه اوونس
type: Concept
broader: ناحیه اینیو کالیفرنیا
preferred label: Owens Lake @en
related: دره اوونس
scope note: دریاچه خشکی در جنوب انتهای دره اوونس، کالیفرنیای مرکزی

ناحیه اینیو کالیفرنیا
type: Concept
narrower: دریاچه اوونس
preferred label: Inyo County California @en