سدّ پاکویما
type: Concept
broader: ناحیه لوس آنجلس کالیفرنیا
preferred label: Pacoima Dam @en
scope note: کناره رود پاکویما در ناحیه لوس آنجلس شمال غرب لوس آنجلس

ناحیه لوس آنجلس کالیفرنیا
type: Concept
narrower: سدّ پاکویما
preferred label: Los Angeles County California @en