ناحیه آرکولتا کلرادو
type: Concept
broader: کلرادو
preferred label: Archuleta County Colorado @en
scope note: واقع در مرز نیومکزیکو در جنوب غرب کلرادو

کلرادو
type: Concept
narrower: ناحیه آرکولتا کلرادو
preferred label: Colorado @en