حوضه نیروی هوایی کلومبوس
type: Concept
broader: ناحیه لوندز می‌سی‌سی‌پی
preferred label: Columbus Air Force Base @en
scope note: 10 مایلی شمال شهر کلومبوس، شمال شرق می سی سی پی

ناحیه لوندز می‌سی‌سی‌پی
type: Concept
narrower: حوضه نیروی هوایی کلومبوس
preferred label: Lowndes County Mississippi @en