ناحیه هاوتون میشیگان
type: Concept
broader: میشیگان
preferred label: Houghton County Michigan @en
scope note: شمال غرب شبه جزیره میشیگان‌علیا. شمال غرب میشیگان.

میشیگان
type: Concept
narrower: ناحیه هاوتون میشیگان
preferred label: Michigan @en