پورتلند ماین
type: Concept
broader: مین
preferred label: Portland Maine @en
scope note: شهری روی شبه جزیره نزدیک جنوب انتهای خلیج کاسکو در جنوب ماین

مین
type: Concept
narrower: پورتلند ماین
preferred label: Maine @en