فلات آپالاچین
type: Concept
preferred label: Appalachian Plateau @en
related: دره موهاوک

دره موهاوک
type: Concept
broader: نیویورک
preferred label: Mohawk Valley @en
related: فلات آپالاچین
scope note: دره رودخانه‌ای در شرق مرکز نیویورک. برای بخشی از انشعاب میانی رود فیدر در شمال شرق کالیفرنیا نیز استفاده می شود.

نیویورک
type: Concept
narrower: دره موهاوک
preferred label: New York @en