وینسبورو ویرجینیا
type: Concept
broader: ویرجینیا
preferred label: Waynesboro Virginia @en
scope note: شهری در ویرجینیا اما مستقل از ناحیه آگوستا در شمال مرکز ویرجینیا

ویرجینیا
type: Concept
narrower: وینسبورو ویرجینیا
preferred label: Virginia @en