ویلینگ ویرجینیای غربی
type: Concept
broader: ویرجینیای غربی
preferred label: Wheeling West Virginia @en
scope note: شهری در کناره رود اوهیو در شمال پنجه آبرفتی در شمال ویرجینیای غربی

ویرجینیای غربی
type: Concept
narrower: ویلینگ ویرجینیای غربی
preferred label: West Virginia @en