ناحیه جفرسون واشنگتن
type: Concept
preferred label: Jefferson County Washington @en
related: المپوس

المپوس
type: Concept
preferred label: Olympus @en
related: ناحیه جفرسون واشنگتن
scope note: بلندترین کوه یونان، شمال شرق یونان. ضمناً برای قله‌ای در ناحیه جفرسون، واشنگتن و سایر مکانها استفاده می‌شود.