کان‌سنگ تیتانیم
type: Concept
preferred label: titanium ore @en
related: لوکوکسن

لوکوکسن
type: Concept
broader: اکسیدها
preferred label: leucoxene @en
related: کان‌سنگ تیتانیم
scope note: نوعی روتیل اسفن‌دار، آگرگات نهان بلور متمایل به سفید، زرد و خرمایی که از دگرسانی و تجزیه کانی‌های تیتان‌دار به وجود می‌آید. مخلوطی از اسفن و روتیل که گاهی از اوقات با بروکیت و هماتیت همراه است.

اکسیدها
type: Concept
narrower: لوکوکسن
preferred label: oxides @en