پشته میان‌اقیانوسی
type: Concept
preferred label: mid-ocean ridge @en
related: پشته کارلسبرگ

پشته کارلسبرگ
type: Concept
alternative label: پشته ميان‌اقيانوسی عربی-هندی
broader: اقیانوس هند
preferred label: Carlsberg Ridge @en
related: پشته میان‌اقیانوسی
scope note: بین جمهوری سومالی و سیکلز در سمت غرب، و جزایر مالدیو و لاکادیو در سمت شرق.

اقیانوس هند
type: Concept
narrower: پشته کارلسبرگ
preferred label: Indian Ocean @en