پشته ناینتی ایست
type: Concept
broader: اقیانوس هند
preferred label: Ninetyeast Ridge @en
scope note: پشته زیردریایی که در جهت شمال و جنوب خط 90 درجه طول شرقی از جنوب جزایر نیکوبار تا حدود 30 درجه عرض جنوبی امتداد دارد.

اقیانوس هند
type: Concept
narrower: پشته ناینتی ایست
preferred label: Indian Ocean @en