فدراسیون روسیه
type: Concept
preferred label: Russian Federation @en
related: دریای سفید

دریای سفید
type: Concept
broader: دریای بارنتز
preferred label: White Sea @en
related: فدراسیون روسیه
scope note: شاخابه بزرگی از دریای بارنتس در جنوب شبه جزیره کولا در شمال غرب فدراسیون روسیه اروپایی

دریای بارنتز
type: Concept
narrower: دریای سفید
preferred label: Barents Sea @en