پشته والویس
type: Concept
broader: اطلس جنوبی
preferred label: Walvis Ridge @en
scope note: در جهت شمال شرقی-جنوب غربی کناره نامیبیا و آفریقای جنوبی در جنوب شرق اطلس واقع شده است

اطلس جنوبی
type: Concept
narrower: پشته والویس
preferred label: South Atlantic @en