آبراهه موری
type: Concept
broader: اطلس شمالی
preferred label: Maury Channel @en
scope note: آبراهه دریایی شرق مرکز پشته ریکجانز و جنوب ایسلند.

اطلس شمالی
type: Concept
narrower: آبراهه موری
preferred label: North Atlantic @en