حوضه اورکا
type: Concept
broader: خلیج مکزیک
preferred label: Orca Basin @en
scope note: فرورفتگی در شیب قاره‌ای شمال مرکز خلیج مکزیک، در برگیرنده برینز

خلیج مکزیک
type: Concept
narrower: حوضه اورکا
preferred label: Gulf of Mexico @en