کانال نروژ
type: Concept
broader: دریای شمال
preferred label: Norwegian Channel @en
scope note: عارضه زیردریایی کاملاً کنار جنوب غربی نروژ.

دریای شمال
type: Concept
narrower: کانال نروژ
preferred label: North Sea @en