ساحل باهامای بزرگ
type: Concept
preferred label: Great Bahama Bank @en
related: ساحل لیتل باهاما

ساحل لیتل باهاما
type: Concept
broader: اطلس شمالی
preferred label: Little Bahama Bank @en
related: ساحل باهامای بزرگ
scope note: جزیره نمایی در شمال باهاما، ما بین جزایر گراندباهاما و گریت آباکو.

اطلس شمالی
type: Concept
narrower: ساحل لیتل باهاما
preferred label: North Atlantic @en