فلات بلیک
type: Concept
alternative label: سکوی باهاما
broader: اطلس شمالی
preferred label: Blake Plateau @en
scope note: شرق شمال فلوریدا و شمال جزیره بزرگ باهاما

اطلس شمالی
type: Concept
narrower: فلات بلیک
preferred label: North Atlantic @en