خلیج پورت فیلیپ
type: Concept
preferred label: Port Phillip Bay @en
related: ملبورن استرالیا

ملبورن استرالیا
type: Concept
broader: ویکتوریا استرالیا
preferred label: Melbourne Australia @en
related: خلیج پورت فیلیپ
scope note: شهری در شمال خلیج پورت فیلیپ، جنوب شرق استرالیا در دهانه رود یارا.

ویکتوریا استرالیا
type: Concept
narrower: ملبورن استرالیا
preferred label: Victoria Australia @en