پاپوا
type: Concept
broader: پاپوا گینه نو
preferred label: Papua @en
scope note: سرزمین قبلی استرالیا، نیمه جنوبی ایالت جدید پاپوا گینه نو در جزیره گینه را مشخص می کند

پاپوا گینه نو
type: Concept
narrower: پاپوا
preferred label: Papua New Guinea @en