پیزا ایتالیا
type: Concept
broader: توسکانی ایتالیا
preferred label: Pisa Italy @en
scope note: شهر و ایالتی در شمال غرب توسکانی، غرب ایتالیا

توسکانی ایتالیا
type: Concept
narrower: پیزا ایتالیا
preferred label: Tuscany Italy @en