دره تاجلیامنتو
type: Concept
broader: ایتالیا
preferred label: Tagliamento Valley @en
related: ونتو ایتالیا
scope note: دره رودخانه‌ای از آلپ کارنیک تا نوک خلیج ونیس امتداد دارد.

ونتو ایتالیا
type: Concept
preferred label: Veneto Italy @en
related: دره تاجلیامنتو

ایتالیا
type: Concept
narrower: دره تاجلیامنتو
preferred label: Italy @en