میلان ایتالیا
type: Concept
broader: لومباردی ایتالیا
preferred label: Milan Italy @en
scope note: ایالتی شامل شهری در غرب لومباردی، شمال ایتالیا.

لومباردی ایتالیا
type: Concept
narrower: میلان ایتالیا
preferred label: Lombardy Italy @en