فرورفتگی لوم
type: Concept
broader: ویدین بلغارستان
preferred label: Lom Depression @en
scope note: در مجاورت رود لوم و شهر لوم در شمال غرب بلغارستان.

ویدین بلغارستان
type: Concept
narrower: فرورفتگی لوم
preferred label: Vidin Bulgaria @en