رشته‌کوه رتزات
type: Concept
broader: ترانسیلوانیا
preferred label: Retezat Mountains @en
related: ترانسیلوانین‌آلپس
scope note: گروهی در غرب ترانسیلوانین‌آلپسیی در جنوب غرب ترانسیلوانیا، غرب مرکز رومانی

ترانسیلوانیا
type: Concept
narrower: رشته‌کوه رتزات
preferred label: Transylvania @en

ترانسیلوانین‌آلپس
type: Concept
preferred label: Transylvanian Alps @en
related: رشته‌کوه رتزات