خلیج آروسا
type: Concept
broader: گالیسیا اسپانیا
preferred label: Arosa Bay @en
related: لاکرونا اسپانیا
scope note: در اقیانوس منجمد شمالی در غرب ما بین ایالت های لاکورنا و پونته ودرا (اسپانیا)

لاکرونا اسپانیا
type: Concept
preferred label: La Coruna Spain @en
related: خلیج آروسا

گالیسیا اسپانیا
type: Concept
narrower: خلیج آروسا
preferred label: Galicia Spain @en