لاریوجا اسپانیا
type: Concept
broader: اسپانیا
preferred label: La Rioja Spain @en
scope note: اتحادیه حکومتی و ایالتی در شمال مرکز اسپانیا.

اسپانیا
type: Concept
narrower: لاریوجا اسپانیا
preferred label: Spain @en