لئون اسپانیا
type: Concept
broader: منطقه لئون
preferred label: Leon Spain @en
scope note: تنها بیانگر شهری در ایالتی در شمال غرب اسپانیا.

منطقه لئون
type: Concept
narrower: لئون اسپانیا
preferred label: Leon Region @en