لیسبون پرتغال
type: Concept
broader: پرتغال
preferred label: Lisbon Portugal @en
scope note: پایتخت و شهر بندری، ناحیه لیسوبا. جنوب غرب ساحل پرتغال.

پرتغال
type: Concept
narrower: لیسبون پرتغال
preferred label: Portugal @en